Target
Sphingosine 1-phosphate receptor 2
Ligand
BDBM41641
Substrate
Meas. Tech.
Counter screen for S1P2 Agonists: Dose Response High Throughput Cell-Based Screen to Identify Activators of CRE-BLA
EC50
>50000±n/a nM
Citation
 PubChem, PC Counter screen for S1P2 Agonists: Dose Response High Throughput Cell-Based Screen to Identify Activators of CRE-BLA PubChem Bioassay (2007)[AID] 
Target
Name:
Sphingosine 1-phosphate receptor 2
Synonyms:
EDG5 S1PR2 Sphingosine 1-phosphate receptor Sphingosine-1-phosphate receptor 2 | ndothelial differentiation G-protein coupled receptor 5
Type:
G Protein-Coupled Receptor (GPCR)
Mol. Mass.:
38883.16
Organism:
Homo sapiens (Human)
Description:
Membranes isolated from S1P2-transfected CHO cells were used in ligand binding assay.
Residue:
353
  
Inhibitor
Name:
BDBM41641
Synonyms:
3-[3,4-dihydro-1H-isoquinolin-2-yl-[1-(2-oxolanylmethyl)-5-tetrazolyl]methyl]-8-methyl-1H-quinolin-2-one 3-[3,4-dihydro-1H-isoquinolin-2-yl-[1-(oxolan-2-ylmethyl)tetrazol-5-yl]methyl]-8-methyl-1H-quinolin-2-one 3-{(3,4-Dihydro-1H-isoquinolin-2-yl)-[1-(tetrahydro-furan-2-ylmethyl)-1H-tetrazol-5-yl]-methyl}-8-methyl-1H-quinolin-2-one SMR000002468 | cid_654033
Type:
Small organic molecule
Emp. Form.:
C26H28N6O2
Mol. Mass.:
456.5395
SMILES:
Cc1cccc2cc(C(N3CCc4ccccc4C3)c3nnnn3CC3CCCO3)c(=O)[nH]c12
: