Target
Sphingosine 1-phosphate receptor 2
Ligand
BDBM41650
Substrate
Meas. Tech.
Counter screen for S1P2 Agonists: Dose Response High Throughput Cell-Based Screen to Identify Activators of CRE-BLA
EC50
>50000±n/a nM
Citation
 PubChem, PC Counter screen for S1P2 Agonists: Dose Response High Throughput Cell-Based Screen to Identify Activators of CRE-BLA PubChem Bioassay (2007)[AID] 
Target
Name:
Sphingosine 1-phosphate receptor 2
Synonyms:
EDG5 S1PR2 Sphingosine 1-phosphate receptor Sphingosine-1-phosphate receptor 2 | ndothelial differentiation G-protein coupled receptor 5
Type:
G Protein-Coupled Receptor (GPCR)
Mol. Mass.:
38883.16
Organism:
Homo sapiens (Human)
Description:
Membranes isolated from S1P2-transfected CHO cells were used in ligand binding assay.
Residue:
353
  
Inhibitor
Name:
BDBM41650
Synonyms:
5-(2-phenoxyethylsulfanyl)-1-phenyl-1,2,3,4-tetrazole 5-(2-phenoxyethylthio)-1-phenyl-tetrazole MLS000056856 cid_1594276
Type:
Small organic molecule
Emp. Form.:
C15H14N4OS
Mol. Mass.:
298.363
SMILES:
C(CSc1nnnn1-c1ccccc1)Oc1ccccc1
: