Target
Sphingosine 1-phosphate receptor 2
Ligand
BDBM41675
Substrate
Meas. Tech.
Counter screen for S1P2 Agonists: Dose Response High Throughput Cell-Based Screen to Identify Activators of CRE-BLA
EC50
6452±n/a nM
Citation
 PubChem, PC Counter screen for S1P2 Agonists: Dose Response High Throughput Cell-Based Screen to Identify Activators of CRE-BLA PubChem Bioassay (2007)[AID] 
Target
Name:
Sphingosine 1-phosphate receptor 2
Synonyms:
EDG5 S1PR2 Sphingosine 1-phosphate receptor Sphingosine-1-phosphate receptor 2 | ndothelial differentiation G-protein coupled receptor 5
Type:
G Protein-Coupled Receptor (GPCR)
Mol. Mass.:
38883.16
Organism:
Homo sapiens (Human)
Description:
Membranes isolated from S1P2-transfected CHO cells were used in ligand binding assay.
Residue:
353
  
Inhibitor
Name:
BDBM41675
Synonyms:
2-Amino-1-benzo[1,3]dioxol-5-ylmethyl-1H-pyrrolo[2,3-b]quinoxaline-3-carboxylic acid (3-methyl-butyl)-amide 2-amino-1-(1,3-benzodioxol-5-ylmethyl)-N-(3-methylbutyl)pyrrolo[3,2-b]quinoxaline-3-carboxamide 2-azanyl-1-(1,3-benzodioxol-5-ylmethyl)-N-(3-methylbutyl)pyrrolo[3,2-b]quinoxaline-3-carboxamide SMR000149001 | cid_1891819
Type:
Small organic molecule
Emp. Form.:
C24H25N5O3
Mol. Mass.:
431.487
SMILES:
CC(C)CCNC(=O)c1c(N)n(Cc2ccc3OCOc3c2)c2nc3ccccc3nc12
: