Target
Sphingosine 1-phosphate receptor 2
Ligand
BDBM41688
Substrate
Meas. Tech.
Counter screen for S1P2 Agonists: Dose Response High Throughput Cell-Based Screen to Identify Activators of CRE-BLA
EC50
>50000±n/a nM
Citation
 PubChem, PC Counter screen for S1P2 Agonists: Dose Response High Throughput Cell-Based Screen to Identify Activators of CRE-BLA PubChem Bioassay (2007)[AID] 
Target
Name:
Sphingosine 1-phosphate receptor 2
Synonyms:
EDG5 S1PR2 Sphingosine 1-phosphate receptor Sphingosine-1-phosphate receptor 2 | ndothelial differentiation G-protein coupled receptor 5
Type:
G Protein-Coupled Receptor (GPCR)
Mol. Mass.:
38883.16
Organism:
Homo sapiens (Human)
Description:
Membranes isolated from S1P2-transfected CHO cells were used in ligand binding assay.
Residue:
353
  
Inhibitor
Name:
BDBM41688
Synonyms:
1-[4-(diethylamino)phenyl]-3-[2-(trifluoromethyl)phenyl]urea N-[4-(diethylamino)phenyl]-N'-[2-(trifluoromethyl)phenyl]urea cid_2206190
Type:
Small organic molecule
Emp. Form.:
C18H20F3N3O
Mol. Mass.:
351.3661
SMILES:
CCN(CC)c1ccc(NC(=O)Nc2ccccc2C(F)(F)F)cc1
: