Target
Multidrug resistance-associated protein 1
Ligand
BDBM44578
Substrate
Meas. Tech.
Identification of Molecular Probes that Activate MRP-1 - Dose Response
EC50
3524±n/a nM
Citation
 PubChem, PC Identification of Molecular Probes that Activate MRP-1 - Dose Response PubChem Bioassay (2007)[AID] 
Target
Name:
Multidrug resistance-associated protein 1
Synonyms:
7.6.2.2 ABCC1 ATP-binding cassette, sub-family C, member 1 isoform 1 LTC4 transporter MRP MRP1_HUMAN
Type:
Mol. Mass.:
171597.72
Organism:
Homo sapiens (Human)
Description:
P33527
Residue:
1531
  
Inhibitor
Name:
BDBM44578
Synonyms:
1-(5-bromanylthiophen-2-yl)sulfonyl-4-methyl-piperidine 1-[(5-bromo-2-thienyl)sulfonyl]-4-methyl-piperidine 1-[(5-bromo-2-thiophenyl)sulfonyl]-4-methylpiperidine MLS000069556 SMR000058825 cid_15209 | cid_893468
Type:
Small organic molecule
Emp. Form.:
C10H14BrNO2S2
Mol. Mass.:
324.258
SMILES:
CC1CCN(CC1)S(=O)(=O)c1ccc(Br)s1
: