Target
Multidrug resistance-associated protein 1
Ligand
BDBM44622
Substrate
Meas. Tech.
Identification of Molecular Probes that Activate MRP-1 - Dose Response
EC50
4036±n/a nM
Citation
 PubChem, PC Identification of Molecular Probes that Activate MRP-1 - Dose Response PubChem Bioassay (2007)[AID] 
Target
Name:
Multidrug resistance-associated protein 1
Synonyms:
7.6.2.2 ABCC1 ATP-binding cassette, sub-family C, member 1 isoform 1 LTC4 transporter MRP MRP1_HUMAN
Type:
Mol. Mass.:
171597.72
Organism:
Homo sapiens (Human)
Description:
P33527
Residue:
1531
  
Inhibitor
Name:
BDBM44622
Synonyms:
2-(4-benzylpiperazin-1-yl)-7-(furan-2-yl)-4-methyl-7,8-dihydro-6H-quinazolin-5-one 7-(2-furanyl)-4-methyl-2-[4-(phenylmethyl)-1-piperazinyl]-7,8-dihydro-6H-quinazolin-5-one MLS000084222 cid_666857
Type:
Small organic molecule
Emp. Form.:
C24H26N4O2
Mol. Mass.:
402.4888
SMILES:
Cc1nc(nc2CC(CC(=O)c12)c1ccco1)N1CCN(Cc2ccccc2)CC1
: