Target
Multidrug resistance-associated protein 1
Ligand
BDBM44684
Substrate
Meas. Tech.
Identification of Molecular Probes that Activate MRP-1 - Dose Response
EC50
5559±n/a nM
Citation
 PubChem, PC Identification of Molecular Probes that Activate MRP-1 - Dose Response PubChem Bioassay (2007)[AID] 
Target
Name:
Multidrug resistance-associated protein 1
Synonyms:
7.6.2.2 ABCC1 ATP-binding cassette, sub-family C, member 1 isoform 1 LTC4 transporter MRP MRP1_HUMAN
Type:
Mol. Mass.:
171597.72
Organism:
Homo sapiens (Human)
Description:
P33527
Residue:
1531
  
Inhibitor
Name:
BDBM44684
Synonyms:
4-[(5-hydroxy-2,2-dimethyl-4-oxo-3,4-dihydro-2H-1-benzopyran-7-yl)oxymethyl]benzoic acid methyl ester MLS000050923 cid_1242695 methyl 4-[(5-hydroxy-2,2-dimethyl-4-oxo-3H-chromen-7-yl)oxymethyl]benzoate | methyl 4-{[(5-hydroxy-2,2-dimethyl-4-oxo-3,4-dihydro-2H-chromen-7-yl)oxy]methyl}benzoate
Type:
Small organic molecule
Emp. Form.:
C20H20O6
Mol. Mass.:
356.3692
SMILES:
COC(=O)c1ccc(COc2cc(O)c3C(=O)CC(C)(C)Oc3c2)cc1
: