Target
Multidrug resistance-associated protein 1
Ligand
BDBM39562
Substrate
Meas. Tech.
Identification of Molecular Probes that Activate MRP-1 - Dose Response
EC50
3118±n/a nM
Citation
 PubChem, PC Identification of Molecular Probes that Activate MRP-1 - Dose Response PubChem Bioassay (2007)[AID] 
Target
Name:
Multidrug resistance-associated protein 1
Synonyms:
7.6.2.2 ABCC1 ATP-binding cassette, sub-family C, member 1 isoform 1 LTC4 transporter MRP MRP1_HUMAN
Type:
Mol. Mass.:
171597.72
Organism:
Homo sapiens (Human)
Description:
P33527
Residue:
1531
  
Inhibitor
Name:
BDBM39562
Synonyms:
MLS000114309 N-(5-phenyl-1,3,4-thiadiazol-2-yl)-2-(1H-1,2,4-triazol-5-ylsulfanyl)ethanamide SMR000091719 | cid_767923
Type:
Small organic molecule
Emp. Form.:
C12H10N6OS2
Mol. Mass.:
318.377
SMILES:
O=C(CSc1nnc[nH]1)Nc1nnc(s1)-c1ccccc1
: