Target
Coagulation factor XII
Ligand
BDBM32801
Substrate
Meas. Tech.
Factor XIIa 1536 HTS Dose Response Confirmation
IC50
365.953333±60.761888 nM
Citation
 PubChem, PC Factor XIIa 1536 HTS Dose Response Confirmation PubChem Bioassay (2008)[AID] 
Target
Name:
Coagulation factor XII
Synonyms:
Beta-factor XIIa part 1 Carboxylesterase 2 (intestine, liver) Coagulation factor XII (FXII) Coagulation factor XIIa light chain FA12_HUMAN Factor XIIa (fXIIa) Hageman factor
Type:
Enzyme
Mol. Mass.:
67810.07
Organism:
Homo sapiens (Human)
Description:
P00748
Residue:
615
  
Inhibitor
Name:
BDBM32801
Synonyms:
1,3-benzodioxol-5-yl(1-benzotriazolyl)methanone MLS000108681 cid_737680
Type:
Small organic molecule
Emp. Form.:
C14H9N3O3
Mol. Mass.:
267.2396
SMILES:
O=C(c1ccc2OCOc2c1)n1nnc2ccccc12
: