Target
Coagulation factor XII
Ligand
BDBM33906
Substrate
Meas. Tech.
Factor XIIa 1536 HTS Dose Response Confirmation
IC50
194.663333±26.381966 nM
Citation
 PubChem, PC Factor XIIa 1536 HTS Dose Response Confirmation PubChem Bioassay (2008)[AID] 
Target
Name:
Coagulation factor XII
Synonyms:
Beta-factor XIIa part 1 Carboxylesterase 2 (intestine, liver) Coagulation factor XII (FXII) Coagulation factor XIIa light chain FA12_HUMAN Factor XIIa (fXIIa) Hageman factor
Type:
Enzyme
Mol. Mass.:
67810.07
Organism:
Homo sapiens (Human)
Description:
P00748
Residue:
615
  
Inhibitor
Name:
BDBM33906
Synonyms:
5-amino-1-(4-methoxybenzoyl)pyrazole-4-carbonitrile 5-amino-1-p-anisoyl-pyrazole-4-carbonitrile MLS001005431 cid_2405928
Type:
Small organic molecule
Emp. Form.:
C12H10N4O2
Mol. Mass.:
242.2334
SMILES:
COc1ccc(cc1)C(=O)n1ncc(C#N)c1N
: