Target
Sphingosine 1-phosphate receptor 2
Ligand
BDBM41580
Substrate
Meas. Tech.
Counterscreen for S1P2 Antagonists: Dose Response Cell-Based Screen to Identify Antagonists of CRE-BLA
IC50
459±n/a nM
Citation
 PubChem, PC Counterscreen for S1P2 Antagonists: Dose Response Cell-Based Screen to Identify Antagonists of CRE-BLA PubChem Bioassay (2008)[AID] 
Target
Name:
Sphingosine 1-phosphate receptor 2
Synonyms:
EDG5 S1PR2 Sphingosine 1-phosphate receptor Sphingosine-1-phosphate receptor 2 | ndothelial differentiation G-protein coupled receptor 5
Type:
G Protein-Coupled Receptor (GPCR)
Mol. Mass.:
38883.16
Organism:
Homo sapiens (Human)
Description:
Membranes isolated from S1P2-transfected CHO cells were used in ligand binding assay.
Residue:
353
  
Inhibitor
Name:
BDBM41580
Synonyms:
(4-nonyl-1,2,3,5,6,7-hexahydrodicyclopenta[1,2-c:1',2'-g]pyridin-8-ylidene)amine;hydrobromide 4-nonyl-2,3,4,5,6,7-hexahydrodicyclopenta[b,e]pyridin-8(1H)-imine SMR000114363 | cid_9549110
Type:
Small organic molecule
Emp. Form.:
C20H32N2
Mol. Mass.:
300.4815
SMILES:
CCCCCCCCCn1c2CCCc2c(=N)c2CCCc12
: