Target
Sphingosine 1-phosphate receptor 2
Ligand
BDBM41583
Substrate
Meas. Tech.
Counterscreen for S1P2 Antagonists: Dose Response Cell-Based Screen to Identify Antagonists of CRE-BLA
IC50
640±n/a nM
Citation
 PubChem, PC Counterscreen for S1P2 Antagonists: Dose Response Cell-Based Screen to Identify Antagonists of CRE-BLA PubChem Bioassay (2008)[AID] 
Target
Name:
Sphingosine 1-phosphate receptor 2
Synonyms:
EDG5 S1PR2 Sphingosine 1-phosphate receptor Sphingosine-1-phosphate receptor 2 | ndothelial differentiation G-protein coupled receptor 5
Type:
G Protein-Coupled Receptor (GPCR)
Mol. Mass.:
38883.16
Organism:
Homo sapiens (Human)
Description:
Membranes isolated from S1P2-transfected CHO cells were used in ligand binding assay.
Residue:
353
  
Inhibitor
Name:
BDBM41583
Synonyms:
2-[1-(2-Chloro-phenyl)-1H-pyrazolo[3,4-d]pyrimidin-4-ylsulfanyl]-N-(2,5-dimethoxy-phenyl)-acetamide 2-[1-(2-chlorophenyl)pyrazolo[3,4-d]pyrimidin-4-yl]sulfanyl-N-(2,5-dimethoxyphenyl)ethanamide 2-[[1-(2-chlorophenyl)pyrazolo[3,4-d]pyrimidin-4-yl]thio]-N-(2,5-dimethoxyphenyl)acetamide SMR000119135 | cid_1445420
Type:
Small organic molecule
Emp. Form.:
C21H18ClN5O3S
Mol. Mass.:
455.917
SMILES:
COc1ccc(OC)c(NC(=O)CSc2ncnc3n(ncc23)-c2ccccc2Cl)c1
: