Target
Sphingosine 1-phosphate receptor 2
Ligand
BDBM41590
Substrate
Meas. Tech.
Counterscreen for S1P2 Antagonists: Dose Response Cell-Based Screen to Identify Antagonists of CRE-BLA
IC50
1256±n/a nM
Citation
 PubChem, PC Counterscreen for S1P2 Antagonists: Dose Response Cell-Based Screen to Identify Antagonists of CRE-BLA PubChem Bioassay (2008)[AID] 
Target
Name:
Sphingosine 1-phosphate receptor 2
Synonyms:
EDG5 S1PR2 Sphingosine 1-phosphate receptor Sphingosine-1-phosphate receptor 2 | ndothelial differentiation G-protein coupled receptor 5
Type:
G Protein-Coupled Receptor (GPCR)
Mol. Mass.:
38883.16
Organism:
Homo sapiens (Human)
Description:
Membranes isolated from S1P2-transfected CHO cells were used in ligand binding assay.
Residue:
353
  
Inhibitor
Name:
BDBM41590
Synonyms:
6-methoxy-2-(4-methoxyphenyl)-3-[3-(trifluoromethyl)phenyl]sulfanyl-1-benzothiophene 1-oxide 6-methoxy-2-(4-methoxyphenyl)-3-[[3-(trifluoromethyl)phenyl]thio]benzothiophene 1-oxide MLS000540587 cid_5863319
Type:
Small organic molecule
Emp. Form.:
C23H17F3O3S2
Mol. Mass.:
462.504
SMILES:
COc1ccc(cc1)-c1c(Sc2cccc(c2)C(F)(F)F)c2ccc(OC)cc2s1=O
: