Target
Sphingosine 1-phosphate receptor 2
Ligand
BDBM41594
Substrate
Meas. Tech.
Counterscreen for S1P2 Antagonists: Dose Response Cell-Based Screen to Identify Antagonists of CRE-BLA
IC50
1838±n/a nM
Citation
 PubChem, PC Counterscreen for S1P2 Antagonists: Dose Response Cell-Based Screen to Identify Antagonists of CRE-BLA PubChem Bioassay (2008)[AID] 
Target
Name:
Sphingosine 1-phosphate receptor 2
Synonyms:
EDG5 S1PR2 Sphingosine 1-phosphate receptor Sphingosine-1-phosphate receptor 2 | ndothelial differentiation G-protein coupled receptor 5
Type:
G Protein-Coupled Receptor (GPCR)
Mol. Mass.:
38883.16
Organism:
Homo sapiens (Human)
Description:
Membranes isolated from S1P2-transfected CHO cells were used in ligand binding assay.
Residue:
353
  
Inhibitor
Name:
BDBM41594
Synonyms:
(Z)-2,3-bis(chloranyl)-3-[(4-methoxyphenyl)methylsulfonyl]-N-(6-methoxypyridin-3-yl)prop-2-enamide (Z)-2,3-dichloro-3-[(4-methoxyphenyl)methylsulfonyl]-N-(6-methoxypyridin-3-yl)prop-2-enamide 2,3-dichloro-3-[(4-methoxybenzyl)sulfonyl]-N-(6-methoxy-3-pyridinyl)acrylamide SMR000125565 | cid_1475343
Type:
Small organic molecule
Emp. Form.:
C17H16Cl2N2O5S
Mol. Mass.:
431.29
SMILES:
COc1ccc(CS(=O)(=O)C(\Cl)=C(\Cl)C(=O)Nc2ccc(OC)nc2)cc1
: