Target
Sphingosine 1-phosphate receptor 2
Ligand
BDBM41603
Substrate
Meas. Tech.
Counterscreen for S1P2 Antagonists: Dose Response Cell-Based Screen to Identify Antagonists of CRE-BLA
IC50
9979±n/a nM
Citation
 PubChem, PC Counterscreen for S1P2 Antagonists: Dose Response Cell-Based Screen to Identify Antagonists of CRE-BLA PubChem Bioassay (2008)[AID] 
Target
Name:
Sphingosine 1-phosphate receptor 2
Synonyms:
EDG5 S1PR2 Sphingosine 1-phosphate receptor Sphingosine-1-phosphate receptor 2 | ndothelial differentiation G-protein coupled receptor 5
Type:
G Protein-Coupled Receptor (GPCR)
Mol. Mass.:
38883.16
Organism:
Homo sapiens (Human)
Description:
Membranes isolated from S1P2-transfected CHO cells were used in ligand binding assay.
Residue:
353
  
Inhibitor
Name:
BDBM41603
Synonyms:
4-(10-Methyl-8-phenyl-6-p-tolylamino-8,11-dihydro-5,7,8,9,11a-pentaaza-cyclopenta[b]phenanthren-11 -yl)-benzene-1,2-diol SMR000145374 | cid_4269692
Type:
Small organic molecule
Emp. Form.:
C32H26N6O2
Mol. Mass.:
526.5878
SMILES:
Cc1nn(c2N=C3N(C(c12)c1ccc(O)c(O)c1)c1ccccc1N=C3Nc1ccc(C)cc1)-c1ccccc1
: