Target
Sphingosine 1-phosphate receptor 2
Ligand
BDBM39718
Substrate
Meas. Tech.
Counterscreen for S1P2 Antagonists: Dose Response Cell-Based Screen to Identify Antagonists of CRE-BLA
IC50
64±n/a nM
Citation
 PubChem, PC Counterscreen for S1P2 Antagonists: Dose Response Cell-Based Screen to Identify Antagonists of CRE-BLA PubChem Bioassay (2008)[AID] 
Target
Name:
Sphingosine 1-phosphate receptor 2
Synonyms:
EDG5 S1PR2 Sphingosine 1-phosphate receptor Sphingosine-1-phosphate receptor 2 | ndothelial differentiation G-protein coupled receptor 5
Type:
G Protein-Coupled Receptor (GPCR)
Mol. Mass.:
38883.16
Organism:
Homo sapiens (Human)
Description:
Membranes isolated from S1P2-transfected CHO cells were used in ligand binding assay.
Residue:
353
  
Inhibitor
Name:
BDBM39718
Synonyms:
(2Z)-1-ethyl-2-[(E)-3-(1-ethyl-3,3-dimethyl-2-indol-1-iumyl)prop-2-enylidene]-3,3-dimethylindole;perchlorate (2Z)-1-ethyl-2-[(E)-3-(1-ethyl-3,3-dimethylindol-1-ium-2-yl)prop-2-enylidene]-3,3-dimethylindole;perchlorate 1-ethyl-2-[(E,3Z)-3-(1-ethyl-3,3-dimethyl-indolin-2-ylidene)prop-1-enyl]-3,3-dimethyl-indol-1-ium;perchlorate SMR000155663 | cid_9551964
Type:
Small organic molecule
Emp. Form.:
C27H33N2
Mol. Mass.:
385.5638
SMILES:
CCN1\C(=C/C=C/C2=[N+](CC)c3ccccc3C2(C)C)C(C)(C)c2ccccc12
: