Target
Sphingosine 1-phosphate receptor 2
Ligand
BDBM41719
Substrate
Meas. Tech.
Counterscreen for S1P2 Agonists: Dose Response High Throughput Cell-Based Screen to Identify Activators of CRE-BLA: S1P2 Purchased Analogues
EC50
>44000±n/a nM
Citation
 PubChem, PC Counterscreen for S1P2 Agonists: Dose Response High Throughput Cell-Based Screen to Identify Activators of CRE-BLA: S1P2 Purchased Analogues PubChem Bioassay (2007)[AID] 
Target
Name:
Sphingosine 1-phosphate receptor 2
Synonyms:
EDG5 S1PR2 Sphingosine 1-phosphate receptor Sphingosine-1-phosphate receptor 2 | ndothelial differentiation G-protein coupled receptor 5
Type:
G Protein-Coupled Receptor (GPCR)
Mol. Mass.:
38883.16
Organism:
Homo sapiens (Human)
Description:
Membranes isolated from S1P2-transfected CHO cells were used in ligand binding assay.
Residue:
353
  
Inhibitor
Name:
BDBM41719
Synonyms:
1-[2,5-dimethyl-1-(phenylmethyl)pyrrol-3-yl]-2-(4-ethanoylphenoxy)ethanone 2-(4-acetylphenoxy)-1-(1-benzyl-2,5-dimethylpyrrol-3-yl)ethanone SR-01000759118-1 | cid_7763884
Type:
Small organic molecule
Emp. Form.:
C23H23NO3
Mol. Mass.:
361.4336
SMILES:
CC(=O)c1ccc(OCC(=O)c2cc(C)n(Cc3ccccc3)c2C)cc1
: