Target
Sphingosine 1-phosphate receptor 2
Ligand
BDBM41722
Substrate
Meas. Tech.
Counterscreen for S1P2 Agonists: Dose Response High Throughput Cell-Based Screen to Identify Activators of CRE-BLA: S1P2 Purchased Analogues
EC50
>44000±n/a nM
Citation
 PubChem, PC Counterscreen for S1P2 Agonists: Dose Response High Throughput Cell-Based Screen to Identify Activators of CRE-BLA: S1P2 Purchased Analogues PubChem Bioassay (2007)[AID] 
Target
Name:
Sphingosine 1-phosphate receptor 2
Synonyms:
EDG5 S1PR2 Sphingosine 1-phosphate receptor Sphingosine-1-phosphate receptor 2 | ndothelial differentiation G-protein coupled receptor 5
Type:
G Protein-Coupled Receptor (GPCR)
Mol. Mass.:
38883.16
Organism:
Homo sapiens (Human)
Description:
Membranes isolated from S1P2-transfected CHO cells were used in ligand binding assay.
Residue:
353
  
Inhibitor
Name:
BDBM41722
Synonyms:
2-hydroxy-2-phenyl-acetic acid [2-(1-benzyl-2,5-dimethyl-pyrrol-3-yl)-2-keto-ethyl] ester SR-01000759121-1 [2-[2,5-dimethyl-1-(phenylmethyl)pyrrol-3-yl]-2-oxidanylidene-ethyl] 2-oxidanyl-2-phenyl-ethanoate | cid_23566939
Type:
Small organic molecule
Emp. Form.:
C23H23NO4
Mol. Mass.:
377.433
SMILES:
Cc1cc(C(=O)COC(=O)C(O)c2ccccc2)c(C)n1Cc1ccccc1
: