Target
Sphingosine 1-phosphate receptor 2
Ligand
BDBM41738
Substrate
Meas. Tech.
Counterscreen for S1P2 Agonists: Dose Response High Throughput Cell-Based Screen to Identify Activators of CRE-BLA: S1P2 Purchased Analogues
EC50
>44000±n/a nM
Citation
 PubChem, PC Counterscreen for S1P2 Agonists: Dose Response High Throughput Cell-Based Screen to Identify Activators of CRE-BLA: S1P2 Purchased Analogues PubChem Bioassay (2007)[AID] 
Target
Name:
Sphingosine 1-phosphate receptor 2
Synonyms:
EDG5 S1PR2 Sphingosine 1-phosphate receptor Sphingosine-1-phosphate receptor 2 | ndothelial differentiation G-protein coupled receptor 5
Type:
G Protein-Coupled Receptor (GPCR)
Mol. Mass.:
38883.16
Organism:
Homo sapiens (Human)
Description:
Membranes isolated from S1P2-transfected CHO cells were used in ligand binding assay.
Residue:
353
  
Inhibitor
Name:
BDBM41738
Synonyms:
2-[[2-(1-benzyl-2,5-dimethyl-pyrrol-3-yl)-2-keto-ethyl]-methyl-amino]-N-propyl-acetamide 2-[[2-[2,5-dimethyl-1-(phenylmethyl)-3-pyrrolyl]-2-oxoethyl]-methylamino]-N-propylacetamide SR-01000759101-1 | cid_8789897
Type:
Small organic molecule
Emp. Form.:
C21H29N3O2
Mol. Mass.:
355.4739
SMILES:
CCCNC(=O)CN(C)CC(=O)c1cc(C)n(Cc2ccccc2)c1C
: