Target
Serine/threonine-protein kinase PLK1
Ligand
BDBM41748
Substrate
Meas. Tech.
Concentration Response Redox Cycling H2O2 Generation assay, 1 mM DTT, to characterize small molecule inhibitors identified in the Polo box domain (PBD) of Plk1 Primary HTS.
EC50
>50000±n/a nM
Citation
 PubChem, PC Concentration Response Redox Cycling H2O2 Generation assay, 1 mM DTT, to characterize small molecule inhibitors identified in the Polo box domain (PBD) of Plk1 Primary HTS. PubChem Bioassay (2007)[AID] 
Target
Name:
Serine/threonine-protein kinase PLK1
Synonyms:
PLK PLK1 Polo-like kinase 1 (PlK1) STPK13 Serine/threonine-protein kinase 13 | polo-like kinase
Type:
Serine/threonine-protein kinase
Mol. Mass.:
68277.16
Organism:
Homo sapiens (Human)
Description:
P53350
Residue:
603
  
Inhibitor
Name:
BDBM41748
Synonyms:
MLS000076456 N-[4-[4-methyl-5-[2-oxo-2-(1,3-thiazol-2-ylamino)ethyl]sulfanyl-1,2,4-triazol-3-yl]phenyl]propanamide N-[4-[5-[[2-keto-2-(thiazol-2-ylamino)ethyl]thio]-4-methyl-1,2,4-triazol-3-yl]phenyl]propionamide SMR000015120 | cid_646718
Type:
Small organic molecule
Emp. Form.:
C17H18N6O2S2
Mol. Mass.:
402.494
SMILES:
CCC(=O)Nc1ccc(cc1)-c1nnc(SCC(=O)Nc2nccs2)n1C
: