Target
Serine/threonine-protein kinase PLK1
Ligand
BDBM41777
Substrate
Meas. Tech.
Concentration Response Redox Cycling H2O2 Generation assay, 1 mM DTT, to characterize small molecule inhibitors identified in the Polo box domain (PBD) of Plk1 Primary HTS.
EC50
>50000±n/a nM
Citation
 PubChem, PC Concentration Response Redox Cycling H2O2 Generation assay, 1 mM DTT, to characterize small molecule inhibitors identified in the Polo box domain (PBD) of Plk1 Primary HTS. PubChem Bioassay (2007)[AID] 
Target
Name:
Serine/threonine-protein kinase PLK1
Synonyms:
PLK PLK1 Polo-like kinase 1 (PlK1) STPK13 Serine/threonine-protein kinase 13 | polo-like kinase
Type:
Serine/threonine-protein kinase
Mol. Mass.:
68277.16
Organism:
Homo sapiens (Human)
Description:
P53350
Residue:
603
  
Inhibitor
Name:
BDBM41777
Synonyms:
1-(2,1,3-benzoxadiazol-4-ylsulfonyl)-N-(2-pyridinyl)-4-piperidinecarboxamide 1-(2,1,3-benzoxadiazol-4-ylsulfonyl)-N-pyridin-2-ylpiperidine-4-carboxamide MLS000090584 cid_3241494
Type:
Small organic molecule
Emp. Form.:
C17H17N5O4S
Mol. Mass.:
387.413
SMILES:
O=C(Nc1ccccn1)C1CCN(CC1)S(=O)(=O)c1cccc2nonc12
: