Target
Serine/threonine-protein kinase PLK1
Ligand
BDBM41789
Substrate
Meas. Tech.
Concentration Response Redox Cycling H2O2 Generation assay, 1 mM DTT, to characterize small molecule inhibitors identified in the Polo box domain (PBD) of Plk1 Primary HTS.
EC50
>50000±n/a nM
Citation
 PubChem, PC Concentration Response Redox Cycling H2O2 Generation assay, 1 mM DTT, to characterize small molecule inhibitors identified in the Polo box domain (PBD) of Plk1 Primary HTS. PubChem Bioassay (2007)[AID] 
Target
Name:
Serine/threonine-protein kinase PLK1
Synonyms:
PLK PLK1 Polo-like kinase 1 (PlK1) STPK13 Serine/threonine-protein kinase 13 | polo-like kinase
Type:
Serine/threonine-protein kinase
Mol. Mass.:
68277.16
Organism:
Homo sapiens (Human)
Description:
P53350
Residue:
603
  
Inhibitor
Name:
BDBM41789
Synonyms:
5,6-bis(chloranyl)-2-ethyl-1H-benzimidazole MLS000064722 cid_972654
Type:
Small organic molecule
Emp. Form.:
C9H8Cl2N2
Mol. Mass.:
215.079
SMILES:
CCc1nc2cc(Cl)c(Cl)cc2[nH]1
: