Target
Serine/threonine-protein kinase PLK1
Ligand
BDBM41801
Substrate
Meas. Tech.
Concentration Response Redox Cycling H2O2 Generation assay, 1 mM DTT, to characterize small molecule inhibitors identified in the Polo box domain (PBD) of Plk1 Primary HTS.
EC50
>50000±n/a nM
Citation
 PubChem, PC Concentration Response Redox Cycling H2O2 Generation assay, 1 mM DTT, to characterize small molecule inhibitors identified in the Polo box domain (PBD) of Plk1 Primary HTS. PubChem Bioassay (2007)[AID] 
Target
Name:
Serine/threonine-protein kinase PLK1
Synonyms:
PLK PLK1 Polo-like kinase 1 (PlK1) STPK13 Serine/threonine-protein kinase 13 | polo-like kinase
Type:
Serine/threonine-protein kinase
Mol. Mass.:
68277.16
Organism:
Homo sapiens (Human)
Description:
P53350
Residue:
603
  
Inhibitor
Name:
BDBM41801
Synonyms:
(3-ethyl-5-methyl-1,2-oxazol-4-yl)-morpholin-4-yl-methanone (3-ethyl-5-methyl-4-isoxazolyl)-(4-morpholinyl)methanone 4-[(3-ethyl-5-methyl-4-isoxazolyl)carbonyl]morpholine SMR000080331 | cid_1245299
Type:
Small organic molecule
Emp. Form.:
C11H16N2O3
Mol. Mass.:
224.2563
SMILES:
CCc1noc(C)c1C(=O)N1CCOCC1
: