Target
Serine/threonine-protein kinase PLK1
Ligand
BDBM39564
Substrate
Meas. Tech.
Concentration Response Redox Cycling H2O2 Generation assay, 1 mM DTT, to characterize small molecule inhibitors identified in the Polo box domain (PBD) of Plk1 Primary HTS.
EC50
>50000±n/a nM
Citation
 PubChem, PC Concentration Response Redox Cycling H2O2 Generation assay, 1 mM DTT, to characterize small molecule inhibitors identified in the Polo box domain (PBD) of Plk1 Primary HTS. PubChem Bioassay (2007)[AID] 
Target
Name:
Serine/threonine-protein kinase PLK1
Synonyms:
PLK PLK1 Polo-like kinase 1 (PlK1) STPK13 Serine/threonine-protein kinase 13 | polo-like kinase
Type:
Serine/threonine-protein kinase
Mol. Mass.:
68277.16
Organism:
Homo sapiens (Human)
Description:
P53350
Residue:
603
  
Inhibitor
Name:
BDBM39564
Synonyms:
2-(2-chlorophenyl)-5-(4-methoxyanilino)-1,3-oxazole-4-carbonitrile 2-(2-chlorophenyl)-5-(p-anisidino)oxazole-4-carbonitrile MLS000103052 cid_946201
Type:
Small organic molecule
Emp. Form.:
C17H12ClN3O2
Mol. Mass.:
325.749
SMILES:
COc1ccc(Nc2oc(nc2C#N)-c2ccccc2Cl)cc1
: