Target
Serine/threonine-protein kinase PLK1
Ligand
BDBM41814
Substrate
Meas. Tech.
Concentration Response Redox Cycling H2O2 Generation assay, 1 mM DTT, to characterize small molecule inhibitors identified in the Polo box domain (PBD) of Plk1 Primary HTS.
EC50
>50000±n/a nM
Citation
 PubChem, PC Concentration Response Redox Cycling H2O2 Generation assay, 1 mM DTT, to characterize small molecule inhibitors identified in the Polo box domain (PBD) of Plk1 Primary HTS. PubChem Bioassay (2007)[AID] 
Target
Name:
Serine/threonine-protein kinase PLK1
Synonyms:
PLK PLK1 Polo-like kinase 1 (PlK1) STPK13 Serine/threonine-protein kinase 13 | polo-like kinase
Type:
Serine/threonine-protein kinase
Mol. Mass.:
68277.16
Organism:
Homo sapiens (Human)
Description:
P53350
Residue:
603
  
Inhibitor
Name:
BDBM41814
Synonyms:
3,5-Dimethoxy-N-(3-morpholin-4-yl-propyl)-benzamide 3,5-dimethoxy-N-(3-morpholinopropyl)benzamide MLS000121576 cid_2163734
Type:
Small organic molecule
Emp. Form.:
C16H24N2O4
Mol. Mass.:
308.3728
SMILES:
COc1cc(OC)cc(c1)C(=O)NCCCN1CCOCC1
: