Target
Serine/threonine-protein kinase PLK1
Ligand
BDBM41817
Substrate
Meas. Tech.
Concentration Response Redox Cycling H2O2 Generation assay, 1 mM DTT, to characterize small molecule inhibitors identified in the Polo box domain (PBD) of Plk1 Primary HTS.
EC50
>50000±n/a nM
Citation
 PubChem, PC Concentration Response Redox Cycling H2O2 Generation assay, 1 mM DTT, to characterize small molecule inhibitors identified in the Polo box domain (PBD) of Plk1 Primary HTS. PubChem Bioassay (2007)[AID] 
Target
Name:
Serine/threonine-protein kinase PLK1
Synonyms:
PLK PLK1 Polo-like kinase 1 (PlK1) STPK13 Serine/threonine-protein kinase 13 | polo-like kinase
Type:
Serine/threonine-protein kinase
Mol. Mass.:
68277.16
Organism:
Homo sapiens (Human)
Description:
P53350
Residue:
603
  
Inhibitor
Name:
BDBM41817
Synonyms:
9-benzo[c]quinolizin-11-iumol;iodide MLS000548877 benzo[c]quinolizin-11-ium-9-ol;iodide | cid_9549757
Type:
Small organic molecule
Emp. Form.:
C13H10NO
Mol. Mass.:
196.2241
SMILES:
Oc1ccc2ccc3cccc[n+]3c2c1
: