Target
Alkaline phosphatase, tissue-nonspecific isozyme
Ligand
BDBM50254372
Substrate
Meas. Tech.
SAR analysis of an In Vitro TNAP Dose Response Luminescent Assay
IC50
375±n/a nM
Citation
 PubChem, PC SAR analysis of an In Vitro TNAP Dose Response Luminescent Assay PubChem Bioassay (2010)[AID] 
Target
Name:
Alkaline phosphatase, tissue-nonspecific isozyme
Synonyms:
ALPL tissue-nonspecific alkaline phosphatase precursor
Type:
PROTEIN
Mol. Mass.:
57306.17
Organism:
Homo sapiens (Human)
Description:
ChEMBL_1448917
Residue:
524
  
Inhibitor
Name:
BDBM50254372
Synonyms:
(3-(2,4-dichlorophenyl)-1H-pyrazol-5-yl)(4-(2-hydroxyethyl)piperazin-1-yl)methanone cid_24178136
Type:
Small organic molecule
Emp. Form.:
C16H18Cl2N4O2
Mol. Mass.:
369.246
SMILES:
OCCN1CCN(CC1)C(=O)c1cc(n[nH]1)-c1ccc(Cl)cc1Cl
: