Target
Alkaline phosphatase, tissue-nonspecific isozyme
Ligand
BDBM46010
Substrate
Meas. Tech.
SAR analysis of an In Vitro TNAP Dose Response Luminescent Assay
IC50
>10000±n/a nM
Citation
 PubChem, PC SAR analysis of an In Vitro TNAP Dose Response Luminescent Assay PubChem Bioassay (2010)[AID] 
Target
Name:
Alkaline phosphatase, tissue-nonspecific isozyme
Synonyms:
ALPL tissue-nonspecific alkaline phosphatase precursor
Type:
PROTEIN
Mol. Mass.:
57306.17
Organism:
Homo sapiens (Human)
Description:
ChEMBL_1448917
Residue:
524
  
Inhibitor
Name:
BDBM46010
Synonyms:
2-methoxy-N-(2-naphthalenyl)benzamide 2-methoxy-N-naphthalen-2-yl-benzamide MLS-0202013.0001 | cid_755757
Type:
Small organic molecule
Emp. Form.:
C18H15NO2
Mol. Mass.:
277.3172
SMILES:
COc1ccccc1C(=O)Nc1ccc2ccccc2c1
: