Target
Serine/threonine-protein kinase PLK1
Ligand
BDBM46106
Substrate
Meas. Tech.
Concentration Response fluorescence polarization-based assay to test PMLSC Chemistry Core synthesized analogs of confirmed hits from the Polo box domain (PBD) of Plk1 Primary HTS.
IC50
>50000±n/a nM
Citation
 PubChem, PC Concentration Response fluorescence polarization-based assay to test PMLSC Chemistry Core synthesized analogs of confirmed hits from the Polo box domain (PBD) of Plk1 Primary HTS. PubChem Bioassay (2008)[AID] 
Target
Name:
Serine/threonine-protein kinase PLK1
Synonyms:
PLK PLK1 Polo-like kinase 1 (PlK1) STPK13 Serine/threonine-protein kinase 13 | polo-like kinase
Type:
Serine/threonine-protein kinase
Mol. Mass.:
68277.16
Organism:
Homo sapiens (Human)
Description:
P53350
Residue:
603
  
Inhibitor
Name:
BDBM46106
Synonyms:
6-hydroxy-4-keto-N-phenyl-2-thioxo-1H-pyrimidine-5-carboxamide 6-oxidanyl-4-oxidanylidene-N-phenyl-2-sulfanylidene-1H-pyrimidine-5-carboxamide UPDDI-00294859 | cid_3000671
Type:
Small organic molecule
Emp. Form.:
C11H9N3O3S
Mol. Mass.:
263.272
SMILES:
Oc1[nH]c(=S)[nH]c(=O)c1C(=O)Nc1ccccc1
: