Target
Serine/threonine-protein kinase PLK1
Ligand
BDBM46109
Substrate
Meas. Tech.
Concentration Response fluorescence polarization-based assay to test PMLSC Chemistry Core synthesized analogs of confirmed hits from the Polo box domain (PBD) of Plk1 Primary HTS.
IC50
>50000±n/a nM
Citation
 PubChem, PC Concentration Response fluorescence polarization-based assay to test PMLSC Chemistry Core synthesized analogs of confirmed hits from the Polo box domain (PBD) of Plk1 Primary HTS. PubChem Bioassay (2008)[AID] 
Target
Name:
Serine/threonine-protein kinase PLK1
Synonyms:
PLK PLK1 Polo-like kinase 1 (PlK1) STPK13 Serine/threonine-protein kinase 13 | polo-like kinase
Type:
Serine/threonine-protein kinase
Mol. Mass.:
68277.16
Organism:
Homo sapiens (Human)
Description:
P53350
Residue:
603
  
Inhibitor
Name:
BDBM46109
Synonyms:
6-amino-2,4-diketo-N-(2-methoxyphenyl)-1H-pyrimidine-5-sulfonamide 6-azanyl-N-(2-methoxyphenyl)-2,4-bis(oxidanylidene)-1H-pyrimidine-5-sulfonamide cid_16654022
Type:
Small organic molecule
Emp. Form.:
C11H12N4O5S
Mol. Mass.:
312.302
SMILES:
COc1ccccc1NS(=O)(=O)c1c(N)[nH]c(=O)[nH]c1=O
: