Target
Serine/threonine-protein kinase PLK1
Ligand
BDBM46110
Substrate
Meas. Tech.
Concentration Response fluorescence polarization-based assay to test PMLSC Chemistry Core synthesized analogs of confirmed hits from the Polo box domain (PBD) of Plk1 Primary HTS.
IC50
>50000±n/a nM
Citation
 PubChem, PC Concentration Response fluorescence polarization-based assay to test PMLSC Chemistry Core synthesized analogs of confirmed hits from the Polo box domain (PBD) of Plk1 Primary HTS. PubChem Bioassay (2008)[AID] 
Target
Name:
Serine/threonine-protein kinase PLK1
Synonyms:
PLK PLK1 Polo-like kinase 1 (PlK1) STPK13 Serine/threonine-protein kinase 13 | polo-like kinase
Type:
Serine/threonine-protein kinase
Mol. Mass.:
68277.16
Organism:
Homo sapiens (Human)
Description:
P53350
Residue:
603
  
Inhibitor
Name:
BDBM46110
Synonyms:
6-amino-2,4-diketo-1-methyl-N-p-phenetyl-pyrimidine-5-carboxamide 6-amino-N-(4-ethoxyphenyl)-1-methyl-2,4-dioxopyrimidine-5-carboxamide UPDDI-00398613 | cid_16654907
Type:
Small organic molecule
Emp. Form.:
C14H16N4O4
Mol. Mass.:
304.3012
SMILES:
CCOc1ccc(NC(=O)c2c(N)n(C)c(=O)[nH]c2=O)cc1
: