Target
Serine/threonine-protein kinase PLK1
Ligand
BDBM46118
Substrate
Meas. Tech.
Concentration Response fluorescence polarization-based assay to test PMLSC Chemistry Core synthesized analogs of confirmed hits from the Polo box domain (PBD) of Plk1 Primary HTS.
IC50
>50000±n/a nM
Citation
 PubChem, PC Concentration Response fluorescence polarization-based assay to test PMLSC Chemistry Core synthesized analogs of confirmed hits from the Polo box domain (PBD) of Plk1 Primary HTS. PubChem Bioassay (2008)[AID] 
Target
Name:
Serine/threonine-protein kinase PLK1
Synonyms:
PLK PLK1 Polo-like kinase 1 (PlK1) STPK13 Serine/threonine-protein kinase 13 | polo-like kinase
Type:
Serine/threonine-protein kinase
Mol. Mass.:
68277.16
Organism:
Homo sapiens (Human)
Description:
P53350
Residue:
603
  
Inhibitor
Name:
BDBM46118
Synonyms:
5-[[(3-methylphenyl)hydrazo]methylidene]-2-sulfanylidene-1,3-diazinane-4,6-dione 5-[[N'-(m-tolyl)hydrazino]methylene]-2-thioxo-hexahydropyrimidine-4,6-quinone cid_5401241
Type:
Small organic molecule
Emp. Form.:
C12H12N4O2S
Mol. Mass.:
276.314
SMILES:
[#6]-c1cccc(-[#7]-[#7]\[#6]=[#6]-2\[#6](=O)-[#7]-[#6](=S)-[#7]-[#6]-2=O)c1
: