Target
Tyrosine-protein phosphatase non-receptor type 7
Ligand
BDBM46199
Substrate
Meas. Tech.
Fluorescent secondary assay for dose-response confirmation of chemical inhibitors of HePTP
IC50
>50000±n/a nM
Citation
 PubChem, PC Fluorescent secondary assay for dose-response confirmation of chemical inhibitors of HePTP PubChem Bioassay (2009)[AID] 
Target
Name:
Tyrosine-protein phosphatase non-receptor type 7
Synonyms:
He-PTP Hematopoietic protein-tyrosine phosphatase (HEPTP) PTPN7 Tyrosine-protein phosphatase non-receptor type 7 | Tyrosine-protein phosphatase non-receptor type 7 (HEPTP)
Type:
Protein
Mol. Mass.:
40530.79
Organism:
Homo sapiens (Human)
Description:
P35236
Residue:
360
  
Inhibitor
Name:
BDBM46199
Synonyms:
1-[2,3-bis(2-furanyl)-6-quinoxalinyl]-3-cyclohexylurea 1-[2,3-bis(furan-2-yl)quinoxalin-6-yl]-3-cyclohexyl-urea MLS-0292137.0001 | cid_24178234
Type:
Small organic molecule
Emp. Form.:
C23H22N4O3
Mol. Mass.:
402.4458
SMILES:
O=C(NC1CCCCC1)Nc1ccc2nc(-c3ccco3)c(nc2c1)-c1ccco1
: