Target
Heat shock cognate 71 kDa protein
Ligand
BDBM31740
Substrate
Meas. Tech.
In Vitro Hsc70 Dose Response Fluorescence Polarization Assay
IC50
95200±2710 nM
Citation
 PubChem, PC In Vitro Hsc70 Dose Response Fluorescence Polarization Assay PubChem Bioassay (2008)[AID] 
Target
Name:
Heat shock cognate 71 kDa protein
Synonyms:
HSC70 HSP7C_HUMAN HSPA8 heat shock 70kDa protein 8 isoform 2
Type:
Enzyme Catalytic Domain
Mol. Mass.:
70887.67
Organism:
Homo sapiens (Human)
Description:
gi_5729877
Residue:
646
  
Inhibitor
Name:
BDBM31740
Synonyms:
8-(2-naphthoxycarbonyl)-3a,4,5,9b-tetrahydro-3H-cyclopenta[c]quinoline-4-carboxylic acid 8-naphthalen-2-yloxycarbonyl-3a,4,5,9b-tetrahydro-3H-cyclopenta[c]quinoline-4-carboxylic acid cid_2914536
Type:
Small organic molecule
Emp. Form.:
C24H19NO4
Mol. Mass.:
385.412
SMILES:
OC(=O)C1Nc2ccc(cc2C2C=CCC12)C(=O)Oc1ccc2ccccc2c1
: