Target
Estrogen receptor beta
Ligand
BDBM42031
Substrate
Meas. Tech.
Estrogen Receptor (beta) binding: Dose Response of Primary Screen Assay
EC50
4527±n/a nM
Citation
 PubChem, PC Estrogen Receptor (beta) binding: Dose Response of Primary Screen Assay PubChem Bioassay (2008)[AID] 
Target
Name:
Estrogen receptor beta
Synonyms:
ER-beta ESR2_HUMAN Estradiol receptor beta (ERβ) Estrogen receptor (ER beta) Estrogen receptor beta (ER beta) NR3A2 estrogen beta
Type:
Protein
Mol. Mass.:
59238.43
Organism:
Homo sapiens (Human)
Description:
Q92731
Residue:
530
  
Inhibitor
Name:
BDBM42031
Synonyms:
4-(3-nitrophenyl)-3a,4,5,9b-tetrahydro-3H-cyclopenta[c]quinoline-6-carboxylic acid cid_2854262
Type:
Small organic molecule
Emp. Form.:
C19H16N2O4
Mol. Mass.:
336.3413
SMILES:
OC(=O)c1cccc2C3C=CCC3C(Nc12)c1cccc(c1)[N+]([O-])=O
: