Target
Nuclear receptor coactivator 2
Ligand
BDBM42884
Substrate
Meas. Tech.
Dose response biochemical High Throughput Screening assay for agonists of the steroid receptor coactivator 2 (SRC-2) recruitment by the peroxisome proliferator-activated receptor gamma (PPARgamma)
EC50
>79370±n/a nM
Citation
 PubChem, PC Dose response biochemical High Throughput Screening assay for agonists of the steroid receptor coactivator 2 (SRC-2) recruitment by the peroxisome proliferator-activated receptor gamma (PPARgamma) PubChem Bioassay (2008)[AID] 
Target
Name:
Nuclear receptor coactivator 2
Synonyms:
BHLHE75 NCOA2 protein SRC2 | TIF2
Type:
Enzyme Catalytic Domain
Mol. Mass.:
159156.93
Organism:
Homo sapiens (Human)
Description:
Q15596
Residue:
1464
  
Inhibitor
Name:
BDBM42884
Synonyms:
2-(3-Benzyl-3H-imidazo[4,5-b]pyridin-2-ylsulfanyl)-N-furan-2-ylmethyl-acetamide 2-[(3-benzylimidazo[4,5-b]pyridin-2-yl)thio]-N-(2-furfuryl)acetamide N-(2-furanylmethyl)-2-[[3-(phenylmethyl)-2-imidazo[4,5-b]pyridinyl]thio]acetamide SMR000005785 | cid_646123
Type:
Small organic molecule
Emp. Form.:
C20H18N4O2S
Mol. Mass.:
378.448
SMILES:
O=C(CSc1nc2cccnc2n1Cc1ccccc1)NCc1ccco1
: