Target
Nuclear receptor coactivator 2
Ligand
BDBM42916
Substrate
Meas. Tech.
Dose response biochemical High Throughput Screening assay for agonists of the steroid receptor coactivator 2 (SRC-2) recruitment by the peroxisome proliferator-activated receptor gamma (PPARgamma)
EC50
>79370±n/a nM
Citation
 PubChem, PC Dose response biochemical High Throughput Screening assay for agonists of the steroid receptor coactivator 2 (SRC-2) recruitment by the peroxisome proliferator-activated receptor gamma (PPARgamma) PubChem Bioassay (2008)[AID] 
Target
Name:
Nuclear receptor coactivator 2
Synonyms:
BHLHE75 NCOA2 protein SRC2 | TIF2
Type:
Enzyme Catalytic Domain
Mol. Mass.:
159156.93
Organism:
Homo sapiens (Human)
Description:
Q15596
Residue:
1464
  
Inhibitor
Name:
BDBM42916
Synonyms:
(5,6-diphenylfuro[2,3-d]pyrimidin-4-yl)-(3-morpholinopropyl)amine N-(3-morpholin-4-ylpropyl)-5,6-diphenyl-furo[2,3-d]pyrimidin-4-amine N-[3-(4-morpholinyl)propyl]-5,6-diphenyl-4-furo[2,3-d]pyrimidinamine cid_667028
Type:
Small organic molecule
Emp. Form.:
C25H26N4O2
Mol. Mass.:
414.4995
SMILES:
C(CNc1ncnc2oc(c(-c3ccccc3)c12)-c1ccccc1)CN1CCOCC1
: