Target
Nuclear receptor coactivator 2
Ligand
BDBM34467
Substrate
Meas. Tech.
Dose response biochemical High Throughput Screening assay for agonists of the steroid receptor coactivator 2 (SRC-2) recruitment by the peroxisome proliferator-activated receptor gamma (PPARgamma)
EC50
71600±n/a nM
Citation
 PubChem, PC Dose response biochemical High Throughput Screening assay for agonists of the steroid receptor coactivator 2 (SRC-2) recruitment by the peroxisome proliferator-activated receptor gamma (PPARgamma) PubChem Bioassay (2008)[AID] 
Target
Name:
Nuclear receptor coactivator 2
Synonyms:
BHLHE75 NCOA2 protein SRC2 | TIF2
Type:
Enzyme Catalytic Domain
Mol. Mass.:
159156.93
Organism:
Homo sapiens (Human)
Description:
Q15596
Residue:
1464
  
Inhibitor
Name:
BDBM34467
Synonyms:
MLS000051238 N-[4-(1,3-benzoxazol-2-yl)phenyl]-3-(1,3-dioxo-2-isoindolyl)propanamide N-[4-(1,3-benzoxazol-2-yl)phenyl]-3-[1,3-bis(oxidanylidene)isoindol-2-yl]propanamide SMR000079222 | cid_1262031
Type:
Small organic molecule
Emp. Form.:
C24H17N3O4
Mol. Mass.:
411.4095
SMILES:
O=C(CCN1C(=O)c2ccccc2C1=O)Nc1ccc(cc1)-c1nc2ccccc2o1
: