Target
Glutathione S-transferase Mu 1
Ligand
BDBM32035
Substrate
Meas. Tech.
Profiling Assay to determine GST-GSH interactions in multiplex bead-based assays (HPSMTB buffer)
EC50
23040±n/a nM
Citation
 PubChem, PC Profiling Assay to determine GST-GSH interactions in multiplex bead-based assays (HPSMTB buffer) PubChem Bioassay (2008)[AID] 
Target
Name:
Glutathione S-transferase Mu 1
Synonyms:
GST class-mu 1 GSTM1 GSTM1_HUMAN GSTM1b-1b Glutathione S-transferase Mu 1 glutathione S-transferase
Type:
PROTEIN
Mol. Mass.:
25712.03
Organism:
Homo sapiens (Human)
Description:
ChEMBL_799596
Residue:
218
  
Inhibitor
Name:
BDBM32035
Synonyms:
MLS000080234 cid_659413
Type:
Small organic molecule
Emp. Form.:
C19H12N2O3
Mol. Mass.:
316.3102
SMILES:
O=C1c2ccccc2-c2onc3ccc(NCc4ccco4)c1c23
: