Target
Glutathione S-transferase Mu 1
Ligand
BDBM32274
Substrate
Meas. Tech.
Profiling Assay to determine GST-GSH interactions in multiplex bead-based assays (HPSMTB buffer)
EC50
220±n/a nM
Citation
 PubChem, PC Profiling Assay to determine GST-GSH interactions in multiplex bead-based assays (HPSMTB buffer) PubChem Bioassay (2008)[AID] 
Target
Name:
Glutathione S-transferase Mu 1
Synonyms:
GST class-mu 1 GSTM1 GSTM1_HUMAN GSTM1b-1b Glutathione S-transferase Mu 1 glutathione S-transferase
Type:
PROTEIN
Mol. Mass.:
25712.03
Organism:
Homo sapiens (Human)
Description:
ChEMBL_799596
Residue:
218
  
Inhibitor
Name:
BDBM32274
Synonyms:
2,5-bis(chloranyl)-3-(4-methylpiperazin-1-yl)-6-(2-piperidin-1-yl-1,3-thiazol-5-yl)cyclohexa-2,5-diene-1,4-dione 2,5-dichloro-3-(4-methyl-1-piperazinyl)-6-[2-(1-piperidinyl)-5-thiazolyl]cyclohexa-2,5-diene-1,4-dione 2,5-dichloro-3-(4-methylpiperazino)-6-(2-piperidinothiazol-5-yl)-p-benzoquinone SMR000115103 | cid_1002249
Type:
Small organic molecule
Emp. Form.:
C19H22Cl2N4O2S
Mol. Mass.:
441.375
SMILES:
CN1CCN(CC1)C1=C(Cl)C(=O)C(c2cnc(s2)N2CCCCC2)=C(Cl)C1=O
: