Target
Bcl-2-like protein 10 [11-204]
Ligand
BDBM33197
Substrate
Meas. Tech.
Multiplexed high-throughput screen for small molecule regulators of Bcl-2 family protein interactions, specifically Bim-Bcl-B protein.
EC50
32060±n/a nM
Citation
 PubChem, PC Multiplexed high-throughput screen for small molecule regulators of Bcl-2 family protein interactions, specifically Bim-Bcl-B protein. PubChem Bioassay (2008)[AID] 
Target
Name:
Bcl-2-like protein 10 [11-204]
Synonyms:
Apoptosis regulator Bcl-B (Bcl-2-like 10 protein) (Bcl2-L-10) (Anti-apoptotic protein NrH). BCL-B BCLB DIVA
Type:
Enzyme Catalytic Domain
Mol. Mass.:
21981.77
Organism:
Homo sapiens (Human)
Description:
gi_23396469
Residue:
194
  
Inhibitor
Name:
BDBM33197
Synonyms:
1-(2-methoxyphenyl)-5-phenyl-4-imidazoline-2-thione MLS001007615 cid_4962043
Type:
Small organic molecule
Emp. Form.:
C16H14N2OS
Mol. Mass.:
282.36
SMILES:
COc1ccccc1-n1c(c[nH]c1=S)-c1ccccc1
: