Target
Bcl-2-like protein 2
Ligand
BDBM33136
Substrate
Meas. Tech.
Multiplexed dose response screen for small molecule regulators of Bcl-2 family protein interactions, specifically Bim-Bcl-W.
EC50
23340±n/a nM
Citation
 PubChem, PC Multiplexed dose response screen for small molecule regulators of Bcl-2 family protein interactions, specifically Bim-Bcl-W. PubChem Bioassay (2008)[AID] 
Target
Name:
Bcl-2-like protein 2
Synonyms:
Apoptosis regulator Bcl-W BCL-W BCLW Bcl2-L-2 | KIAA0271
Type:
Protein
Mol. Mass.:
20742.61
Organism:
Homo sapiens (Human)
Description:
Residue:
193
  
Inhibitor
Name:
BDBM33136
Synonyms:
4-bromanyl-2-[(E)-3-(4-ethoxyphenyl)prop-2-enoyl]-7-(ethylamino)cyclohepta-2,4,6-trien-1-one 4-bromo-2-[(E)-3-(4-ethoxyphenyl)prop-2-enoyl]-7-(ethylamino)cyclohepta-2,4,6-trien-1-one 4-bromo-7-(ethylamino)-2-[(E)-3-p-phenetylacryloyl]cyclohepta-2,4,6-trien-1-one SMR000229853 | cid_7314643
Type:
Small organic molecule
Emp. Form.:
C20H20BrNO3
Mol. Mass.:
402.282
SMILES:
CCNc1ccc(Br)cc(C(=O)\C=C\c2ccc(OCC)cc2)c1=O
: