Target
Bcl-2-like protein 2
Ligand
BDBM33157
Substrate
Meas. Tech.
Multiplexed dose response screen for small molecule regulators of Bcl-2 family protein interactions, specifically Bim-Bcl-W.
EC50
14810±n/a nM
Citation
 PubChem, PC Multiplexed dose response screen for small molecule regulators of Bcl-2 family protein interactions, specifically Bim-Bcl-W. PubChem Bioassay (2008)[AID] 
Target
Name:
Bcl-2-like protein 2
Synonyms:
Apoptosis regulator Bcl-W BCL-W BCLW Bcl2-L-2 | KIAA0271
Type:
Protein
Mol. Mass.:
20742.61
Organism:
Homo sapiens (Human)
Description:
Residue:
193
  
Inhibitor
Name:
BDBM33157
Synonyms:
MLS000687602 [2,3-bis(2-furanyl)-6-quinoxalinyl]-phenylmethanone [2,3-bis(furan-2-yl)quinoxalin-6-yl]-phenyl-methanone cid_1037240
Type:
Small organic molecule
Emp. Form.:
C23H14N2O3
Mol. Mass.:
366.3689
SMILES:
O=C(c1ccccc1)c1ccc2nc(-c3ccco3)c(nc2c1)-c1ccco1
: