Target
Nuclear receptor coactivator 3
Ligand
BDBM42893
Substrate
Meas. Tech.
Dose response biochemical High Throughput Screening assay for agonists of the steroid receptor coactivator 3 (SRC-3) recruitment by the peroxisome proliferator-activated receptor gamma (PPARgamma)
EC50
53530±n/a nM
Citation
 PubChem, PC Dose response biochemical High Throughput Screening assay for agonists of the steroid receptor coactivator 3 (SRC-3) recruitment by the peroxisome proliferator-activated receptor gamma (PPARgamma) PubChem Bioassay (2008)[AID] 
Target
Name:
Nuclear receptor coactivator 3
Synonyms:
AIB1 NCOA3 RAC3 nuclear receptor coactivator 3 isoform a
Type:
Enzyme Catalytic Domain
Mol. Mass.:
155305.29
Organism:
Homo sapiens (Human)
Description:
Q9Y6Q9
Residue:
1424
  
Inhibitor
Name:
BDBM42893
Synonyms:
1-(4-Methoxy-phenyl)-2-{5-[4-(morpholine-4-sulfonyl)-phenyl]-[1,3,4]oxadiazol-2-ylsulfanyl}-ethanone 1-(4-methoxyphenyl)-2-[[5-(4-morpholinosulfonylphenyl)-1,3,4-oxadiazol-2-yl]thio]ethanone MLS000070168 cid_653411
Type:
Small organic molecule
Emp. Form.:
C21H21N3O6S2
Mol. Mass.:
475.538
SMILES:
COc1ccc(cc1)C(=O)CSc1nnc(o1)-c1ccc(cc1)S(=O)(=O)N1CCOCC1
: