Target
Nuclear receptor coactivator 3
Ligand
BDBM42983
Substrate
Meas. Tech.
Dose response biochemical High Throughput Screening assay for agonists of the steroid receptor coactivator 3 (SRC-3) recruitment by the peroxisome proliferator-activated receptor gamma (PPARgamma)
EC50
>79370±n/a nM
Citation
 PubChem, PC Dose response biochemical High Throughput Screening assay for agonists of the steroid receptor coactivator 3 (SRC-3) recruitment by the peroxisome proliferator-activated receptor gamma (PPARgamma) PubChem Bioassay (2008)[AID] 
Target
Name:
Nuclear receptor coactivator 3
Synonyms:
AIB1 NCOA3 RAC3 nuclear receptor coactivator 3 isoform a
Type:
Enzyme Catalytic Domain
Mol. Mass.:
155305.29
Organism:
Homo sapiens (Human)
Description:
Q9Y6Q9
Residue:
1424
  
Inhibitor
Name:
BDBM42983
Synonyms:
1-[3-(4-Fluoro-phenyl)-3-hydroxy-8-aza-bicyclo[3.2.1]oct-8-yl]-2-methyl-propan-1-one 1-[3-(4-fluorophenyl)-3-hydroxy-8-azabicyclo[3.2.1]octan-8-yl]-2-methyl-propan-1-one 1-[3-(4-fluorophenyl)-3-oxidanyl-8-azabicyclo[3.2.1]octan-8-yl]-2-methyl-propan-1-one SMR000119960 | cid_3230886
Type:
Small organic molecule
Emp. Form.:
C17H22FNO2
Mol. Mass.:
291.3605
SMILES:
[H]C12CCC([H])(CC(O)(C1)c1ccc(F)cc1)N2C(=O)C(C)C
: