Target
Nuclear receptor coactivator 3
Ligand
BDBM43004
Substrate
Meas. Tech.
Dose response biochemical High Throughput Screening assay for agonists of the steroid receptor coactivator 3 (SRC-3) recruitment by the peroxisome proliferator-activated receptor gamma (PPARgamma)
EC50
33570±n/a nM
Citation
 PubChem, PC Dose response biochemical High Throughput Screening assay for agonists of the steroid receptor coactivator 3 (SRC-3) recruitment by the peroxisome proliferator-activated receptor gamma (PPARgamma) PubChem Bioassay (2008)[AID] 
Target
Name:
Nuclear receptor coactivator 3
Synonyms:
AIB1 NCOA3 RAC3 nuclear receptor coactivator 3 isoform a
Type:
Enzyme Catalytic Domain
Mol. Mass.:
155305.29
Organism:
Homo sapiens (Human)
Description:
Q9Y6Q9
Residue:
1424
  
Inhibitor
Name:
BDBM43004
Synonyms:
2-[[5-(4-ketocyclohexa-2,5-dien-1-ylidene)-3-isoxazoline-3-carbonyl]amino]benzoic acid methyl ester MLS000522877 cid_9551347 methyl 2-[[5-(4-oxocyclohexa-2,5-dien-1-ylidene)-2H-1,2-oxazole-3-carbonyl]amino]benzoate
Type:
Small organic molecule
Emp. Form.:
C18H14N2O5
Mol. Mass.:
338.3142
SMILES:
COC(=O)c1ccccc1NC(=O)c1cc(on1)-c1ccc(O)cc1
: