Target
Ras-related C3 botulinum toxin substrate 1
Ligand
BDBM43207
Substrate
Meas. Tech.
Multiplexed dose response to identify specific small molecule inhibitors of Ras and Ras-related GTPases specifically Rac wildtype
EC50
5803±n/a nM
Citation
 PubChem, PC Multiplexed dose response to identify specific small molecule inhibitors of Ras and Ras-related GTPases specifically Rac wildtype PubChem Bioassay (2010)[AID] 
Target
Name:
Ras-related C3 botulinum toxin substrate 1
Synonyms:
RAC1_MOUSE Rac1 protein
Type:
PROTEIN
Mol. Mass.:
21455.91
Organism:
Mus musculus
Description:
EBI_101485
Residue:
192
  
Inhibitor
Name:
BDBM43207
Synonyms:
2-[(2,6-dichlorobenzyl)amino]-3-methyl-butyric acid 2-[[2,6-bis(chloranyl)phenyl]methylamino]-3-methyl-butanoic acid N-(2,6-dichlorobenzyl)valine cid_3237092
Type:
Small organic molecule
Emp. Form.:
C12H15Cl2NO2
Mol. Mass.:
276.159
SMILES:
CC(C)C(NCc1c(Cl)cccc1Cl)C(O)=O
: