Target
Ras-related C3 botulinum toxin substrate 1
Ligand
BDBM43216
Substrate
Meas. Tech.
Multiplexed dose response to identify specific small molecule inhibitors of Ras and Ras-related GTPases specifically Rac wildtype
EC50
4020±n/a nM
Citation
 PubChem, PC Multiplexed dose response to identify specific small molecule inhibitors of Ras and Ras-related GTPases specifically Rac wildtype PubChem Bioassay (2010)[AID] 
Target
Name:
Ras-related C3 botulinum toxin substrate 1
Synonyms:
RAC1_MOUSE Rac1 protein
Type:
PROTEIN
Mol. Mass.:
21455.91
Organism:
Mus musculus
Description:
EBI_101485
Residue:
192
  
Inhibitor
Name:
BDBM43216
Synonyms:
(5Z)-2-(3,4-dihydro-1H-isoquinolin-2-yl)-5-(4-ethoxybenzylidene)-2-thiazolin-4-one (5Z)-2-(3,4-dihydro-1H-isoquinolin-2-yl)-5-[(4-ethoxyphenyl)methylidene]-4-thiazolone MLS000590730 cid_1876676
Type:
Small organic molecule
Emp. Form.:
C21H20N2O2S
Mol. Mass.:
364.461
SMILES:
CCOc1ccc(\C=C2/SC(=NC2=O)N2CCc3ccccc3C2)cc1
: