Target
Ras-related C3 botulinum toxin substrate 1
Ligand
BDBM46328
Substrate
Meas. Tech.
Multiplexed dose response to identify specific small molecule inhibitors of Ras and Ras-related GTPases specifically Rac wildtype
EC50
99.86±n/a nM
Citation
 PubChem, PC Multiplexed dose response to identify specific small molecule inhibitors of Ras and Ras-related GTPases specifically Rac wildtype PubChem Bioassay (2010)[AID] 
Target
Name:
Ras-related C3 botulinum toxin substrate 1
Synonyms:
RAC1_MOUSE Rac1 protein
Type:
PROTEIN
Mol. Mass.:
21455.91
Organism:
Mus musculus
Description:
EBI_101485
Residue:
192
  
Inhibitor
Name:
BDBM46328
Synonyms:
MLS000393082 N-[3-(1H-benzimidazol-2-yl)-4,5,6,7-tetrahydro-1-benzothiophen-2-yl]-2-chloro-5-(4-ethylpiperazin-1-yl)sulfonylbenzamide N-[3-(1H-benzimidazol-2-yl)-4,5,6,7-tetrahydrobenzothiophen-2-yl]-2-chloro-5-(4-ethylpiperazino)sulfonyl-benzamide cid_2497075
Type:
Small organic molecule
Emp. Form.:
C28H30ClN5O3S2
Mol. Mass.:
584.153
SMILES:
CCN1CCN(CC1)S(=O)(=O)c1ccc(Cl)c(c1)C(=O)Nc1sc2CCCCc2c1-c1nc2ccccc2[nH]1
: