Target
Ras-related C3 botulinum toxin substrate 1
Ligand
BDBM43235
Substrate
Meas. Tech.
Multiplexed dose response to identify specific small molecule inhibitors of Ras and Ras-related GTPases specifically Rac wildtype
EC50
1523±n/a nM
Citation
 PubChem, PC Multiplexed dose response to identify specific small molecule inhibitors of Ras and Ras-related GTPases specifically Rac wildtype PubChem Bioassay (2010)[AID] 
Target
Name:
Ras-related C3 botulinum toxin substrate 1
Synonyms:
RAC1_MOUSE Rac1 protein
Type:
PROTEIN
Mol. Mass.:
21455.91
Organism:
Mus musculus
Description:
EBI_101485
Residue:
192
  
Inhibitor
Name:
BDBM43235
Synonyms:
2-[2-(4-chlorophenyl)ethylamino]benzoic acid cid_7721337
Type:
Small organic molecule
Emp. Form.:
C15H14ClNO2
Mol. Mass.:
275.73
SMILES:
OC(=O)c1ccccc1NCCc1ccc(Cl)cc1
: